[PyKDE] pyqt compile failing under osx

Chris Wright wrightca at hotmail.com
Tue Mar 9 12:04:01 GMT 2004

I get the following error when compiling PyQt under OS X

sipqttableQCheckTableItem.cpp: In member function `QString
sipqttableQCheckTableItem.cpp:349: error: 'class QTableItem' has no member
   named 'content'
make[1]: *** [sipqttableQCheckTableItem.o] Error 1
make: *** [all] Error 2

Mac OS X 10.3.2
Qt/Mac 3.3.1

qt runs fine (or at least examples/demo.app does!), and I am out of my C++ 
depth here :)

thanks for any help

Chris Wright

Find love today with ninemsn personals. Click here:  

More information about the PyQt mailing list